Target
Polyunsaturated fatty acid lipoxygenase ALOX15B
Ligand
BDBM106776
Substrate
Meas. Tech.
IC50 Assay
pH
7.3±n/a
Temperature
298.15±n/a K
IC50
>3.0e+4±n/a nM
Comments
extracted
Citation
 Mascayano, CEspinosa, VSepúlveda-Boza, SHoobler, EKPerry, SDiaz, GHolman, TR Enzymatic Studies of Isoflavonoids as Selective and Potent Inhibitors of Human Leukocyte 5-Lipo-Oxygenase. Chem Biol Drug Des 86:114-21 (2015)  
Target
Name:
Polyunsaturated fatty acid lipoxygenase ALOX15B
Synonyms:
15-LOX-2 15-Lipoxygenase-2 (15-LOX-2) ALOX15B Arachidonate 15-lipoxygenase, type II Epithelial 15-lipoxygenase-2 | LX15B_HUMAN
Type:
Protein
Mol. Mass.:
75850.40
Organism:
Homo sapiens (Human)
Description:
Residue:
676
  
Inhibitor
Name:
BDBM106776
Synonyms:
3‐(3‐chlorophenyl)‐6,7‐dihydroxy‐4H‐chromen‐4‐one IR-8
Type:
Small organic molecule
Emp. Form.:
C15H9ClO4
Mol. Mass.:
288.683
SMILES:
Oc1cc2occ(-c3cccc(Cl)c3)c(=O)c2cc1O
: