Target
Phospholipase
Ligand
BDBM154528
Substrate
Meas. Tech.
Exogenous PldA Assay
pH
7.5±n/a
IC50
2.2e+4± 1.1e+3 nM
Comments
extracted
Citation
 Scott, SASpencer, CTO'Reilly, MCBrown, KALavieri, RRCho, CHJung, DILarock, RCBrown, HALindsley, CW Discovery of desketoraloxifene analogues as inhibitors of mammalian, Pseudomonas aeruginosa, and NAPE phospholipase D enzymes. ACS Chem Biol 10:421-32 (2015)  
Target
Name:
Phospholipase
Synonyms:
Phospholipase D (PldA)
Type:
Protein
Mol. Mass.:
122309.70
Organism:
Pseudomonas aeruginosa (g-Proteobacteria)
Description:
A0A0C6EPQ5
Residue:
1099
  
Inhibitor
Name:
BDBM154528
Synonyms:
234H (17l)
Type:
Small organic molecule
Emp. Form.:
C27H27NO2S
Mol. Mass.:
429.574
SMILES:
COc1ccc(cc1)-c1sc2ccccc2c1-c1ccc(OCCN2CCCC2)cc1
: