Target
Replicase polyprotein 1ab [1541-1855]
Ligand
BDBM31530
Substrate
Meas. Tech.
Fluorimetric Assay
pH
7.5±n/a
IC50
1.18e+3± 8e+1 nM
Comments
extracted
Citation
 Lee, HLei, HSantarsiero, BDGatuz, JLCao, SRice, AJPatel, KSzypulinski, MZOjeda, IGhosh, AKJohnson, ME Inhibitor recognition specificity of MERS-CoV papain-like protease may differ from that of SARS-CoV. ACS Chem Biol 10:1456-65 (2015)  
Target
Name:
Replicase polyprotein 1ab [1541-1855]
Synonyms:
R1AB_SARS SARS-CoV PLpro rep
Type:
Hydrolase
Mol. Mass.:
35352.30
Organism:
Human SARS coronavirus (SARS-CoV)
Description:
The SARS-CoV PLpro enzyme (residues 1541 -1855) was expressed and purified from E. coli.
Residue:
315
  
Inhibitor
Name:
BDBM31530
Synonyms:
2-methyl-5-[(methylamino)methyl]-N-[(1R)-1-(naphthalen-1-yl)ethyl]benzamide (I-2) med.21724, Compound 164
Type:
Small organic molecule
Emp. Form.:
C22H24N2O
Mol. Mass.:
332.4388
SMILES:
CNCc1ccc(C)c(c1)C(=O)N[C@H](C)c1cccc2ccccc12
: