Target
Cyclin-dependent kinase 2 [C118L]
Ligand
BDBM154576
Substrate
Meas. Tech.
ITC Assay
pH
7.5±0
Temperature
1107.6±0 K
Kd
18.6±2.9 nM
Citation
 Alexander, LTMöbitz, HDrueckes, PSavitsky, PFedorov, OElkins, JMDeane, CMCowan-Jacob, SWKnapp, S Type II Inhibitors Targeting CDK2. ACS Chem Biol 10:2116-25 (2015)  
Target
Name:
Cyclin-dependent kinase 2 [C118L]
Synonyms:
CDK2 CDKN2 | Cyclin-dependent protein kinase 2 variant (CDK2 C118L)
Type:
Protein
Mol. Mass.:
33948.19
Organism:
Homo sapiens (Human)
Description:
CDK2 mutant (C118L)
Residue:
298
  
Inhibitor
Name:
BDBM154576
Synonyms:
K03861 (1)
Type:
Small organic molecule
Emp. Form.:
C24H26F3N7O2
Mol. Mass.:
501.5041
SMILES:
CN1CCN(Cc2ccc(NC(=O)Nc3ccc(Oc4ccnc(N)n4)cc3)cc2C(F)(F)F)CC1
: