Target
Orexin receptor type 2
Ligand
BDBM154945
Substrate
Meas. Tech.
In Vitro Assay
Temperature
310.15±n/a K
IC50
171±n/a nM
Comments
extracted
Citation
 Boss, CBrotschi, CGatfield, JGude, MHeidmann, BSifferlen, TWilliams, JT Proline sulfonamide derivatives as orexin receptor antagonists US Patent  US9000029 Publication Date 4/7/2015 
Target
Name:
Orexin receptor type 2
Synonyms:
HCRTR2 OX2R_HUMAN Orexin receptor type 2 (OR-2) Orexin receptor type 2 (OX2R) Ox-2-R | Ox2-R
Type:
Protein
Mol. Mass.:
50710.53
Organism:
Homo sapiens (Human)
Description:
O43614
Residue:
444
  
Inhibitor
Name:
BDBM154945
Synonyms:
US9000029, 24
Type:
Small organic molecule
Emp. Form.:
C22H22N2O4S
Mol. Mass.:
410.486
SMILES:
COc1ccc(cc1)S(=O)(=O)N1CCC[C@H]1C(=O)Nc1cccc2ccccc12
: