Target
Estrogen receptor
Ligand
BDBM158504
Substrate
Meas. Tech.
Binding Assay
pH
7.5±n/a
Temperature
298.15±n/a K
Ki
0.23±n/a nM
Comments
extracted
Citation
 Coelingh Bennink, HJBunschoten, EJ Pharmaceutical composition comprising estetrol derivatives for use in cancer therapy US Patent  US9034854 Publication Date 5/19/2015 
Target
Name:
Estrogen receptor
Synonyms:
ER ESR ESR1_HUMAN Estrogen receptor Estrogen receptor (ER-alpha) Estrogen receptor alpha (ER) Nuclear receptor subfamily 3 group A member 1
Type:
Protein
Mol. Mass.:
66230.44
Organism:
Homo sapiens (Human)
Description:
P03372
Residue:
595
  
Inhibitor
Name:
BDBM158504
Synonyms:
US9034854, EE US9561238, EE
Type:
Small organic molecule
Emp. Form.:
C20H24O2
Mol. Mass.:
296.4034
SMILES:
CC12CC[C@H]3[C@@H](CCc4cc(O)ccc34)[C@@H]1CC[C@@]2(O)C#C
: