Target
2-acylglycerol O-acyltransferase 2
Ligand
BDBM159701
Substrate
Meas. Tech.
Inhibition Assay
IC50
24±n/a nM
Citation
 Busujima, TOi, TTanaka, HShirasaki, YIwakiri, KSato, NTokita, S Nitrogen-containing condensed heterocyclic compound US Patent  US9035059 Publication Date 5/19/2015 
Target
Name:
2-acylglycerol O-acyltransferase 2
Synonyms:
2-acylglycerol O-acyltransferase 2 Acyl-CoA:monoacylglycerol acyltransferase 2 (MOGAT2) DGAT2L5 Diacylglycerol acyltransferase 2-like protein 5 MOGAT2 Monoacylglycerol Acyltransferase 2 (MGAT2) hDC5 | hMGAT2
Type:
Enzyme
Mol. Mass.:
38210.80
Organism:
Homo sapiens (Human)
Description:
Q3SYC2
Residue:
334
  
Inhibitor
Name:
BDBM159701
Synonyms:
US9035059, 17-5
Type:
Small organic molecule
Emp. Form.:
C38H45FN2O3S
Mol. Mass.:
628.839
SMILES:
CC(C)(C)c1ccc(CCN2CCc3cc(ccc3C2)S(=O)(=O)Nc2ccc(OCCCCCc3ccccc3)cc2F)cc1
: