Target
2-acylglycerol O-acyltransferase 2
Ligand
BDBM159702
Substrate
Meas. Tech.
Inhibition Assay
IC50
39±n/a nM
Citation
 Busujima, TOi, TTanaka, HShirasaki, YIwakiri, KSato, NTokita, S Nitrogen-containing condensed heterocyclic compound US Patent  US9035059 Publication Date 5/19/2015 
Target
Name:
2-acylglycerol O-acyltransferase 2
Synonyms:
2-acylglycerol O-acyltransferase 2 Acyl-CoA:monoacylglycerol acyltransferase 2 (MOGAT2) DGAT2L5 Diacylglycerol acyltransferase 2-like protein 5 MOGAT2 Monoacylglycerol Acyltransferase 2 (MGAT2) hDC5 | hMGAT2
Type:
Enzyme
Mol. Mass.:
38210.80
Organism:
Homo sapiens (Human)
Description:
Q3SYC2
Residue:
334
  
Inhibitor
Name:
BDBM159702
Synonyms:
US9035059, 17-6
Type:
Small organic molecule
Emp. Form.:
C36H47FN2O3S
Mol. Mass.:
606.833
SMILES:
CC(C)(C)c1ccc(CCN2CCc3cc(ccc3C2)S(=O)(=O)Nc2ccc(OCCCC3CCCCC3)cc2F)cc1
: