Target
N-glycosylase/DNA lyase
Ligand
BDBM163688
Substrate
Meas. Tech.
Fluorescence-based Assay
pH
7.5±n/a
Temperature
310.15±n/a K
IC50
4.56e+3± 1.29e+3 nM
Comments
extracted
Citation
 Donley, NJaruga, PCoskun, EDizdaroglu, MMcCullough, AKLloyd, RS Small Molecule Inhibitors of 8-Oxoguanine DNA Glycosylase-1 (OGG1). ACS Chem Biol 10:2334-43 (2015)  
Target
Name:
N-glycosylase/DNA lyase
Synonyms:
8-Oxoguanine DNA glycosylase-1 (OGG1) MUTM OGG1_HUMAN | OGH1
Type:
Protein
Mol. Mass.:
38794.33
Organism:
Homo sapiens (Human)
Description:
O15527
Residue:
345
  
Inhibitor
Name:
BDBM163688
Synonyms:
2,4‐Dichloro‐N'‐(1‐propylpiperidin‐4‐ ylidene)benzohydrazide (0181)
Type:
Small organic molecule
Emp. Form.:
C15H19Cl2N3O
Mol. Mass.:
328.237
SMILES:
[#6]-[#6]-[#6]-[#7]-1-[#6]-[#6]\[#6](-[#6]-[#6]-1)=[#7]/[#7]-[#6](=O)-c1ccc(Cl)cc1Cl
: