Target
Catenin beta-1/Protein Wnt-3a
Ligand
BDBM148364
Substrate
Meas. Tech.
Luciferase Assay
IC50
650±n/a nM
Citation
 Moriyama, HSawa, MUno, YKashimoto, SYamada, T Quinazoline derivative US Patent  US9682961 Publication Date 6/20/2017 
Target
Name:
Catenin beta-1/Protein Wnt-3a
Synonyms:
Wnt/beta-Catenin
Type:
Protein
Mol. Mass.:
Description:
Components:
This complex has 2 components.
Component 1
Name:
Protein Wnt-3a
Synonyms:
WNT3A | WNT3A_HUMAN
Type:
PROTEIN
Mol. Mass.:
39379.02
Organism:
Homo sapiens (Human)
Description:
ChEMBL_1469237
Residue:
352
  
Component 2
Name:
Catenin beta-1
Synonyms:
CTNB1_HUMAN CTNNB1
Type:
PROTEIN
Mol. Mass.:
85484.08
Organism:
Homo sapiens (Human)
Description:
ChEMBL_1504364
Residue:
781
  
Inhibitor
Name:
BDBM148364
Synonyms:
US9682961, 17
Type:
Small organic molecule
Emp. Form.:
C22H23N5O2
Mol. Mass.:
389.4503
SMILES:
Cc1ccc2cnc(Nc3ccc4nc[nH]c4c3)nc2c1O[C@@H]1CC[C@H](O)CC1
: