Target
DNA gyrase subunit B
Ligand
BDBM166647
Substrate
Meas. Tech.
GyraseB Assay
pH
7.5±n/a
IC50
2.763e+4± 1.09e+3 nM
Comments
extracted
Citation
 Janupally, RMedepi, BBrindha Devi, PSuryadevara, PJeankumar, VUKulkarni, PYogeeswari, PSriram, D Design and Biological Evaluation of Furan/Pyrrole/Thiophene-2-carboxamide Derivatives as Efficient DNA GyraseB Inhibitors of Staphylococcus aureus. Chem Biol Drug Des 86:918-25 (2015)  
Target
Name:
DNA gyrase subunit B
Synonyms:
DNA gyrase DNA gyrase subunit B (gyrB) gyrB
Type:
Enzyme Subunit
Mol. Mass.:
72530.91
Organism:
Staphylococcus aureus
Description:
Residue:
644
  
Inhibitor
Name:
BDBM166647
Synonyms:
4-((4-(5-methylfuran-2-carboxamido)phenyl)amino)-4-oxobutanoic acid (6)
Type:
Small organic molecule
Emp. Form.:
C17H18N2O5
Mol. Mass.:
330.3352
SMILES:
COC(=O)CCC(=O)Nc1ccc(NC(=O)c2ccc(C)o2)cc1
: