Target
DNA gyrase subunit B
Ligand
BDBM166659
Substrate
Meas. Tech.
GyraseB Assay
pH
7.5±n/a
IC50
2.949e+4± 8.1e+2 nM
Comments
extracted
Citation
 Janupally, RMedepi, BBrindha Devi, PSuryadevara, PJeankumar, VUKulkarni, PYogeeswari, PSriram, D Design and Biological Evaluation of Furan/Pyrrole/Thiophene-2-carboxamide Derivatives as Efficient DNA GyraseB Inhibitors of Staphylococcus aureus. Chem Biol Drug Des 86:918-25 (2015)  
Target
Name:
DNA gyrase subunit B
Synonyms:
DNA gyrase DNA gyrase subunit B (gyrB) gyrB
Type:
Enzyme Subunit
Mol. Mass.:
72530.91
Organism:
Staphylococcus aureus
Description:
Residue:
644
  
Inhibitor
Name:
BDBM166659
Synonyms:
4-(4-(5-nitrothiophene-2-carboxamido)phenylamino)-4-oxobutanoate (18)
Type:
Small organic molecule
Emp. Form.:
C15H12N3O6S
Mol. Mass.:
362.338
SMILES:
[O-]C(=O)CCC(=O)Nc1ccc(NC(=O)c2ccc(s2)[N+]([O-])=O)cc1
: