Target
DNA gyrase subunit B
Ligand
BDBM166664
Substrate
Meas. Tech.
Supercoiling Assay
pH
7.6±n/a
Temperature
298.15±n/a K
IC50
2.51e+4± 4.4e+2 nM
Comments
extracted
Citation
 Janupally, RMedepi, BBrindha Devi, PSuryadevara, PJeankumar, VUKulkarni, PYogeeswari, PSriram, D Design and Biological Evaluation of Furan/Pyrrole/Thiophene-2-carboxamide Derivatives as Efficient DNA GyraseB Inhibitors of Staphylococcus aureus. Chem Biol Drug Des 86:918-25 (2015)  
Target
Name:
DNA gyrase subunit B
Synonyms:
DNA gyrase DNA gyrase subunit B (gyrB) gyrB
Type:
Enzyme Subunit
Mol. Mass.:
72530.91
Organism:
Staphylococcus aureus
Description:
Residue:
644
  
Inhibitor
Name:
BDBM166664
Synonyms:
N-(4-(4-Hydrazinyl-4-oxobutanamido)phenyl)-5-nitrofuran-2-carboxamide (23)
Type:
Small organic molecule
Emp. Form.:
C15H15N5O6
Mol. Mass.:
361.3095
SMILES:
NNC(=O)CCC(=O)Nc1ccc(NC(=O)c2ccc(o2)[N+]([O-])=O)cc1
: