Target
DNA gyrase subunit B
Ligand
BDBM166666
Substrate
Meas. Tech.
Supercoiling Assay
pH
7.6±n/a
Temperature
298.15±n/a K
IC50
6.12e+3± 2.2e+2 nM
Comments
extracted
Citation
 Janupally, RMedepi, BBrindha Devi, PSuryadevara, PJeankumar, VUKulkarni, PYogeeswari, PSriram, D Design and Biological Evaluation of Furan/Pyrrole/Thiophene-2-carboxamide Derivatives as Efficient DNA GyraseB Inhibitors of Staphylococcus aureus. Chem Biol Drug Des 86:918-25 (2015)  
Target
Name:
DNA gyrase subunit B
Synonyms:
DNA gyrase DNA gyrase subunit B (gyrB) gyrB
Type:
Enzyme Subunit
Mol. Mass.:
72530.91
Organism:
Staphylococcus aureus
Description:
Residue:
644
  
Inhibitor
Name:
BDBM166666
Synonyms:
N-(4-(4-Hydrazinyl-4-oxobutanamido)phenyl)-5-methylthiophene-2-carboxamide (25)
Type:
Small organic molecule
Emp. Form.:
C16H18N4O3S
Mol. Mass.:
346.404
SMILES:
Cc1ccc(s1)C(=O)Nc1ccc(NC(=O)CCC(=O)NN)cc1
: