Target
DNA gyrase subunit B
Ligand
BDBM166668
Substrate
Meas. Tech.
Supercoiling Assay
pH
7.6±n/a
Temperature
298.15±n/a K
IC50
4.31e+4± 6.8e+2 nM
Comments
extracted
Citation
 Janupally, RMedepi, BBrindha Devi, PSuryadevara, PJeankumar, VUKulkarni, PYogeeswari, PSriram, D Design and Biological Evaluation of Furan/Pyrrole/Thiophene-2-carboxamide Derivatives as Efficient DNA GyraseB Inhibitors of Staphylococcus aureus. Chem Biol Drug Des 86:918-25 (2015)  
Target
Name:
DNA gyrase subunit B
Synonyms:
DNA gyrase DNA gyrase subunit B (gyrB) gyrB
Type:
Enzyme Subunit
Mol. Mass.:
72530.91
Organism:
Staphylococcus aureus
Description:
Residue:
644
  
Inhibitor
Name:
BDBM166668
Synonyms:
N-(4-(4-Hydrazinyl-4-oxobutanamido)phenyl)-1H-pyrrole-2-carboxamide (27)
Type:
Small organic molecule
Emp. Form.:
C15H17N5O3
Mol. Mass.:
315.3272
SMILES:
NNC(=O)CCC(=O)Nc1ccc(NC(=O)c2ccc[nH]2)cc1
: