Target
Carboxylic ester hydrolase
Ligand
BDBM50022775
Substrate
Meas. Tech.
AChE and BChE Inhibition Assay
pH
8±n/a
Temperature
298.15±n/a K
IC50
4.96e+4± 6.11e+3 nM
Comments
extracted
Citation
 Hameed, AZehra, STShah, SJKhan, KMAlharthy, RDFurtmann, NBajorath, JTahir, MNIqbal, J Syntheses, cholinesterases inhibition, and molecular docking studies of pyrido[2,3-b]pyrazine derivatives. Chem Biol Drug Des 86:1115-20 (2015)  
Target
Name:
Carboxylic ester hydrolase
Synonyms:
BuChE Butyrylcholine esterase Butyrylcholinesterase (BChE) Butyrylcholinesterase (EqBuChE) butyrylcholinesterase precursor
Type:
Protein
Mol. Mass.:
68842.83
Organism:
Equus caballus (Horse)
Description:
Q9N1N9
Residue:
602
  
Inhibitor
Name:
BDBM50022775
Synonyms:
(m-Hydroxyphenyl)trimethylammonium dimethylcarbamate 3-[(dimethylcarbamoyl)oxy]-N,N,N-trimethylanilinium CHEMBL278020 Eustigmine Neostigmine (2) Vagostigmine | m-Trimethylammoniumphenyldimethylcarbamate
Type:
Small organic molecule
Emp. Form.:
C12H19N2O2
Mol. Mass.:
223.2909
SMILES:
CN(C)C(=O)Oc1cccc(c1)[N+](C)(C)C
: