Target
3-hydroxy-3-methylglutaryl-coenzyme A reductase
Ligand
BDBM155379
Substrate
Meas. Tech.
Reductase Assay
IC50
2±n/a nM
Citation
 Lindsay, DJackson, P Use of rosuvastatin lactols as medicaments US Patent  US9102656 Publication Date 8/11/2015 
Target
Name:
3-hydroxy-3-methylglutaryl-coenzyme A reductase
Synonyms:
3-hydroxy-3-methylglutaryl-coenzyme A (HMG-CoA) reductase HMDH_HUMAN HMG-CoA reductase (HMGR) | HMGCR
Type:
Enzyme
Mol. Mass.:
97477.10
Organism:
Homo sapiens (Human)
Description:
P04035
Residue:
888
  
Inhibitor
Name:
BDBM155379
Synonyms:
US9006282, Example 2, Compound 7 | US9102656, Example 2, Compound 7
Type:
Small organic molecule
Emp. Form.:
C31H35Cl3FN3O5S
Mol. Mass.:
687.049
SMILES:
CC(C)c1nc(nc(-c2ccc(F)cc2)c1\C=C\[C@@H]1C[C@H](CC(OCC(Cl)(Cl)Cl)O1)OCc1ccccc1)N(C)S(C)(=O)=O
: