Target
Oligo-1,6-glucosidase IMA1
Ligand
BDBM175315
Substrate
Meas. Tech.
Baker's Yeast α-Glucosidase Inhibition Assay
pH
6.8±n/a
IC50
8.44e+3± 7.6e+2 nM
Comments
extracted
Citation
 Zawawi, NKTaha, MAhmat, NWadood, AIsmail, NHRahim, FAzam, SSAbdullah, N Benzimidazole derivatives as new a-glucosidase inhibitors and in silico studies. Bioorg Chem 64:29-36 (2016)  
Target
Name:
Oligo-1,6-glucosidase IMA1
Synonyms:
α-glucosidase Alpha-glucosidase (α-glucosidase) MALX3_YEAST | Oligo-1,6-glucosidase
Type:
Protein
Mol. Mass.:
68577.59
Organism:
Saccharomyces cerevisiae S288c (Baker's yeast)
Description:
Residue:
589
  
Inhibitor
Name:
BDBM175315
Synonyms:
(E)-4-(5,6-dimethyl-1H-benzo[d]imidazol-2-yl)-N'-(2-hydroxy-4-methoxybenzylidene) benzohydrazide (10)
Type:
Small organic molecule
Emp. Form.:
C24H22N4O3
Mol. Mass.:
414.4565
SMILES:
COc1ccc(\C=N\NC(=O)c2ccc(cc2)-c2nc3cc(C)c(C)cc3[nH]2)c(O)c1
: