Target
Oligo-1,6-glucosidase IMA1
Ligand
BDBM175330
Substrate
Meas. Tech.
Baker's Yeast α-Glucosidase Inhibition Assay
pH
6.8±n/a
IC50
1.935e+4± 7.6e+2 nM
Comments
extracted
Citation
 Zawawi, NKTaha, MAhmat, NWadood, AIsmail, NHRahim, FAzam, SSAbdullah, N Benzimidazole derivatives as new a-glucosidase inhibitors and in silico studies. Bioorg Chem 64:29-36 (2016)  
Target
Name:
Oligo-1,6-glucosidase IMA1
Synonyms:
α-glucosidase Alpha-glucosidase (α-glucosidase) MALX3_YEAST | Oligo-1,6-glucosidase
Type:
Protein
Mol. Mass.:
68577.59
Organism:
Saccharomyces cerevisiae S288c (Baker's yeast)
Description:
Residue:
589
  
Inhibitor
Name:
BDBM175330
Synonyms:
(E)-4-(5,6-dimethyl-1H-benzo[d]imidazol-2-yl)-N'-(4-nitrobenzylidene) benzohydrazide (25)
Type:
Small organic molecule
Emp. Form.:
C23H19N5O3
Mol. Mass.:
413.4287
SMILES:
Cc1cc2nc([nH]c2cc1C)-c1ccc(cc1)C(=O)N\N=C\c1ccc(cc1)[N+]([O-])=O
: