Target
Adenosine receptor A3 [I248L]
Ligand
BDBM175364
Substrate
Meas. Tech.
Radioligand Binding Assay
Ki
5.86e+3±n/a nM
Citation
 Yadav, RBansal, RRohilla, SKachler, SKlotz, KN Synthesis and pharmacological characterization of novel xanthine carboxylate amides as A2A adenosine receptor ligands exhibiting bronchospasmolytic activity. Bioorg Chem 65:26-37 (2016)  
Target
Name:
Adenosine receptor A3 [I248L]
Synonyms:
AA3R_HUMAN Adenosine receptor A3 | Adenosine receptor A3 (A3)
Type:
Protein
Mol. Mass.:
36197.32
Organism:
Homo sapiens (Human)
Description:
P0DMS8[I248L]
Residue:
318
  
Inhibitor
Name:
BDBM175364
Synonyms:
1,3-Dimethyl-8-[4-(2-methoxy-2-oxoethoxy)-phenyl]xanthine (13, RB-419)
Type:
Small organic molecule
Emp. Form.:
C16H16N4O5
Mol. Mass.:
344.322
SMILES:
COC(=O)COc1ccc(cc1)-c1nc2n(C)c(=O)n(C)c(=O)c2[nH]1
: