Target
Adenosine receptor A3 [I248L]
Ligand
BDBM175367
Substrate
Meas. Tech.
Radioligand Binding Assay
Ki
1.07e+4±n/a nM
Citation
 Yadav, RBansal, RRohilla, SKachler, SKlotz, KN Synthesis and pharmacological characterization of novel xanthine carboxylate amides as A2A adenosine receptor ligands exhibiting bronchospasmolytic activity. Bioorg Chem 65:26-37 (2016)  
Target
Name:
Adenosine receptor A3 [I248L]
Synonyms:
AA3R_HUMAN Adenosine receptor A3 | Adenosine receptor A3 (A3)
Type:
Protein
Mol. Mass.:
36197.32
Organism:
Homo sapiens (Human)
Description:
P0DMS8[I248L]
Residue:
318
  
Inhibitor
Name:
BDBM175367
Synonyms:
1,3-Dimethyl-8-[{3-(2-methoxy-2-oxoethoxy)-4-methoxy}-phenyl]xanthine (16, RB-410)
Type:
Small organic molecule
Emp. Form.:
C17H18N4O6
Mol. Mass.:
374.348
SMILES:
COC(=O)COc1cc(ccc1OC)-c1nc2n(C)c(=O)n(C)c(=O)c2[nH]1
: