Target
Adenosine receptor A3 [I248L]
Ligand
BDBM175401
Substrate
Meas. Tech.
Radioligand Binding Assay
Ki
>1.0e+4±n/a nM
Citation
 Yadav, RBansal, RRohilla, SKachler, SKlotz, KN Synthesis and pharmacological characterization of novel xanthine carboxylate amides as A2A adenosine receptor ligands exhibiting bronchospasmolytic activity. Bioorg Chem 65:26-37 (2016)  
Target
Name:
Adenosine receptor A3 [I248L]
Synonyms:
AA3R_HUMAN Adenosine receptor A3 | Adenosine receptor A3 (A3)
Type:
Protein
Mol. Mass.:
36197.32
Organism:
Homo sapiens (Human)
Description:
P0DMS8[I248L]
Residue:
318
  
Inhibitor
Name:
BDBM175401
Synonyms:
1,3-Dimethyl-8-[4-methoxy-3-{2-(1-methylpiperazin-4-yl)-2-oxo-ethoxy}-phenyl]xanthine (16g, RB-416)
Type:
Small organic molecule
Emp. Form.:
C21H26N6O5
Mol. Mass.:
442.4683
SMILES:
COc1ccc(cc1OCC(=O)N1CCN(C)CC1)-c1nc2n(C)c(=O)n(C)c(=O)c2[nH]1
: