Target
Mitogen-activated protein kinase 1
Ligand
BDBM180952
Substrate
Meas. Tech.
Enzymatic Assay
pH
7.3±n/a
IC50
4.1±n/a nM
Comments
extracted
Citation
 Blake, JFChen, HChicarelli, MJDemeese, JGarrey, RGaudino, JJKaus, RJKolakowski, GRMarlow, ALMohr, PJRen, LSchwarz, JSiedem, CSThomas, AAWallace, EWenglowsky, SMBoyd, S Serine/threonine kinase inhibitors US Patent  US9133187 Publication Date 9/15/2015 
Target
Name:
Mitogen-activated protein kinase 1
Synonyms:
ERK2 Extracellular signal-regulated kinase 2 Extracellular signal-regulated kinase 2 (ERK2) MAPK 2 MK01_HUMAN Mitogen-activated protein kinase 1 (ERK-2) Mitogen-activated protein kinase 2 PRKM2 | p42-MAPK
Type:
Ser/Thr Protein Kinase
Mol. Mass.:
41392.76
Organism:
Homo sapiens (Human)
Description:
P28482
Residue:
360
  
Inhibitor
Name:
BDBM180952
Synonyms:
US9133187, I-66
Type:
Small organic molecule
Emp. Form.:
C21H26F4N6O
Mol. Mass.:
454.4644
SMILES:
CNC[C@@H](NC(=O)N1CCc2cnc(NC(C)C)nc2C1)c1ccc(c(F)c1)C(F)(F)F
: