Target
Mitogen-activated protein kinase 1
Ligand
BDBM181006
Substrate
Meas. Tech.
Enzymatic Assay
pH
7.3±n/a
IC50
3.15±n/a nM
Comments
extracted
Citation
 Blake, JFChen, HChicarelli, MJDemeese, JGarrey, RGaudino, JJKaus, RJKolakowski, GRMarlow, ALMohr, PJRen, LSchwarz, JSiedem, CSThomas, AAWallace, EWenglowsky, SMBoyd, S Serine/threonine kinase inhibitors US Patent  US9133187 Publication Date 9/15/2015 
Target
Name:
Mitogen-activated protein kinase 1
Synonyms:
ERK2 Extracellular signal-regulated kinase 2 Extracellular signal-regulated kinase 2 (ERK2) MAPK 2 MK01_HUMAN Mitogen-activated protein kinase 1 (ERK-2) Mitogen-activated protein kinase 2 PRKM2 | p42-MAPK
Type:
Ser/Thr Protein Kinase
Mol. Mass.:
41392.76
Organism:
Homo sapiens (Human)
Description:
P28482
Residue:
360
  
Inhibitor
Name:
BDBM181006
Synonyms:
US9133187, II-371
Type:
Small organic molecule
Emp. Form.:
C20H23Cl2N5O2
Mol. Mass.:
436.335
SMILES:
C[C@@H](NC(=O)N1CCc2cnc(N[C@@H]3C[C@H](O)C3)nc2C1)c1ccc(Cl)c(Cl)c1
: