Target
D(2) dopamine receptor
Ligand
BDBM185695
Substrate
Meas. Tech.
Beta-Arrestin Recruitment (Tango) Assay
pH
7.4±n/a
EC50
0.4±n/a nM
Comments
extracted
Citation
 Jin, JRoth, BFrye, S Functionally selective ligands of dopamine D2 receptors US Patent  US9156822 Publication Date 10/13/2015 
Target
Name:
D(2) dopamine receptor
Synonyms:
D(2) dopamine receptor DOPAMINE D2 Long DRD2 Dopamine D2 receptor Dopamine D2 receptor (D2R) Dopamine2-like | d2
Type:
Cell-surface receptors
Mol. Mass.:
50647.10
Organism:
Homo sapiens (Human)
Description:
P14416
Residue:
443
  
Inhibitor
Name:
BDBM185695
Synonyms:
UNC10108010 | US9156822, 38
Type:
Small organic molecule
Emp. Form.:
C25H30N4O4
Mol. Mass.:
450.5301
SMILES:
O=C1CCc2ccc(OCCCCN3CCN(CC3)c3cccc4NC(=O)COc34)cc2N1
: