Target
Cell division cycle 7-related protein kinase
Ligand
BDBM185863
Substrate
Meas. Tech.
Inhibition Assay
pH
7.5±n/a
Ki
2.4±n/a nM
Comments
extracted
Target
Name:
Cell division cycle 7-related protein kinase
Synonyms:
CDC7 CDC7L1 Cell division cycle 7-related protein kinase (CDC7) huCdc7
Type:
Protein
Mol. Mass.:
63908.16
Organism:
Homo sapiens (Human)
Description:
O00311
Residue:
574
  
Inhibitor
Name:
BDBM185863
Synonyms:
US9163007, 205
Type:
Small organic molecule
Emp. Form.:
C26H21FN6O
Mol. Mass.:
452.4829
SMILES:
Fc1cccc(c1)C(=O)Nc1n[nH]c2ccc(cc12)-c1nnn(Cc2ccccc2)c1C1CC1
: