Target
Dihydrolipoyl dehydrogenase
Ligand
BDBM119876
Substrate
Meas. Tech.
Inhibition Assay
pH
7±n/a
IC50
700±80 nM
Comments
extracted
Citation
 Wong, CWu, Y Compounds and methods for treating tuberculosis infection US Patent  US9073941 Publication Date 7/7/2015 
Target
Name:
Dihydrolipoyl dehydrogenase
Synonyms:
DLDH_MYCTU lpd | lpdC
Type:
Enzyme
Mol. Mass.:
49231.98
Organism:
Mycobacterium tuberculosis
Description:
P9WHH9
Residue:
464
  
Inhibitor
Name:
BDBM119876
Synonyms:
SL932 | US9073941, 503
Type:
Small organic molecule
Emp. Form.:
C15H16BrClN4O4S
Mol. Mass.:
463.734
SMILES:
COc1ccc(NC(=O)CN(C)S(=O)(=O)c2cc(Br)cnc2N)cc1Cl
: