Target
Dihydrolipoyl dehydrogenase
Ligand
BDBM50438912
Substrate
Meas. Tech.
Inhibition Assay
pH
7±n/a
IC50
<40±n/a nM
Comments
extracted
Citation
 Wong, CWu, Y Compounds and methods for treating tuberculosis infection US Patent  US9073941 Publication Date 7/7/2015 
Target
Name:
Dihydrolipoyl dehydrogenase
Synonyms:
DLDH_MYCTU lpd | lpdC
Type:
Enzyme
Mol. Mass.:
49231.98
Organism:
Mycobacterium tuberculosis
Description:
P9WHH9
Residue:
464
  
Inhibitor
Name:
BDBM50438912
Synonyms:
CHEMBL1096283 MAT-POS-1e0c1c67-1 Walrycin B
Type:
Small organic molecule
Emp. Form.:
C14H10F3N5O2
Mol. Mass.:
337.2567
SMILES:
Cn1nc(nc2c1nc(=O)n(C)c2=O)-c1ccc(cc1)C(F)(F)F
: