Target
Dihydrolipoyl dehydrogenase
Ligand
BDBM188292
Substrate
Meas. Tech.
Inhibition Assay
pH
7±n/a
IC50
<40±n/a nM
Comments
extracted
Citation
 Wong, CWu, Y Compounds and methods for treating tuberculosis infection US Patent  US9073941 Publication Date 7/7/2015 
Target
Name:
Dihydrolipoyl dehydrogenase
Synonyms:
DLDH_MYCTU lpd | lpdC
Type:
Enzyme
Mol. Mass.:
49231.98
Organism:
Mycobacterium tuberculosis
Description:
P9WHH9
Residue:
464
  
Inhibitor
Name:
BDBM188292
Synonyms:
US9073941, 620
Type:
Small organic molecule
Emp. Form.:
C14H12N6O4
Mol. Mass.:
328.2829
SMILES:
CCn1nc(nc2c1nc(=O)n(C)c2=O)-c1ccc(cc1)[N+]([O-])=O
: