Target
Dihydrolipoyl dehydrogenase
Ligand
BDBM188309
Substrate
Meas. Tech.
Inhibition Assay
pH
7±n/a
IC50
860±160 nM
Comments
extracted
Citation
 Wong, CWu, Y Compounds and methods for treating tuberculosis infection US Patent  US9073941 Publication Date 7/7/2015 
Target
Name:
Dihydrolipoyl dehydrogenase
Synonyms:
DLDH_MYCTU lpd | lpdC
Type:
Enzyme
Mol. Mass.:
49231.98
Organism:
Mycobacterium tuberculosis
Description:
P9WHH9
Residue:
464
  
Inhibitor
Name:
BDBM188309
Synonyms:
US9073941, 1006
Type:
Small organic molecule
Emp. Form.:
C20H17N5OS
Mol. Mass.:
375.447
SMILES:
CCCCn1c(NC(=O)c2cccs2)c(C#N)c2nc3ccccc3nc12
: