Target
Dihydrolipoyl dehydrogenase
Ligand
BDBM188315
Substrate
Meas. Tech.
Inhibition Assay
pH
7±n/a
IC50
1620±240 nM
Comments
extracted
Citation
 Wong, CWu, Y Compounds and methods for treating tuberculosis infection US Patent  US9073941 Publication Date 7/7/2015 
Target
Name:
Dihydrolipoyl dehydrogenase
Synonyms:
DLDH_MYCTU lpd | lpdC
Type:
Enzyme
Mol. Mass.:
49231.98
Organism:
Mycobacterium tuberculosis
Description:
P9WHH9
Residue:
464
  
Inhibitor
Name:
BDBM188315
Synonyms:
US9073941, 1101
Type:
Small organic molecule
Emp. Form.:
C17H18N4O2S2
Mol. Mass.:
374.48
SMILES:
COCCN(C(=O)c1cccs1)c1nc-2c(CCc3c-2cnn3C)s1
: