Target
Histone-lysine N-methyltransferase EZH2
Ligand
BDBM172176
Substrate
Meas. Tech.
Inhibition Assay
IC50
0.9±n/a nM
Citation
 Kuntz, KWKnutson, SKWigle, TJ Inhibitors of human EZH2, and methods of use thereof US Patent  US9175331 Publication Date 11/3/2015 
Target
Name:
Histone-lysine N-methyltransferase EZH2
Synonyms:
ENX-1 EZH2_HUMAN Histone-lysine N-methyltransferase EZH2 Lysine N-methyltransferase 6
Type:
Protein
Mol. Mass.:
85367.84
Organism:
Homo sapiens (Human)
Description:
Q15910
Residue:
746
  
Inhibitor
Name:
BDBM172176
Synonyms:
EPZ009161 US11052093, Compound 184 US9175331, 61
Type:
Small organic molecule
Emp. Form.:
C34H46N6O3
Mol. Mass.:
586.7674
SMILES:
CCCc1cc(C)[nH]c(=O)c1CNC(=O)c1cc(cc(N(CC)C2CCOCC2)c1C)-c1ccc(nc1)N1CCNCC1
: