Target
Arachidonate 15-lipoxygenase
Ligand
BDBM21383
Substrate
Meas. Tech.
LoxA HTP Assay
Temperature
298.15±n/a K
IC50
1.14e+4± 1.9e+3 nM
Comments
extracted
Citation
 Deschamps, JDOgunsola, AFJameson, JBYasgar, AFlitter, BAFreedman, CJMelvin, JANguyen, JVMaloney, DJJadhav, ASimeonov, ABomberger, JMHolman, TR Biochemical and Cellular Characterization and Inhibitor Discovery of Pseudomonas aeruginosa 15-Lipoxygenase. Biochemistry 55:3329-40 (2016)  
Target
Name:
Arachidonate 15-lipoxygenase
Synonyms:
15-Lipoxygenase (LoxA)
Type:
Protein
Mol. Mass.:
74804.41
Organism:
Pseudomonas aeruginosa
Description:
Residue:
685
  
Inhibitor
Name:
BDBM21383
Synonyms:
6-[4-(2-phenylphenyl)piperazin-1-yl]-N-(1,2,3,4-tetrahydronaphthalen-1-yl)hexanamide Piperazinehexanamide derivative, 21
Type:
Small organic molecule
Emp. Form.:
C32H39N3O
Mol. Mass.:
481.6716
SMILES:
O=C(CCCCCN1CCN(CC1)c1ccccc1-c1ccccc1)NC1CCCc2ccccc12
: