Target
Adenosine receptor A3 [I248L]
Ligand
BDBM191056
Substrate
Meas. Tech.
Radioligand Binding Assay
pH
7.5±n/a
Temperature
298.15±n/a K
Ki
52±14 nM
Comments
extracted
Citation
 Jacobson, KATosh, DK Adenosine receptor agonists, partial agonists, and antagonists US Patent  US9181253 Publication Date 11/10/2015 
Target
Name:
Adenosine receptor A3 [I248L]
Synonyms:
AA3R_HUMAN Adenosine receptor A3 | Adenosine receptor A3 (A3)
Type:
Protein
Mol. Mass.:
36197.32
Organism:
Homo sapiens (Human)
Description:
P0DMS8[I248L]
Residue:
318
  
Inhibitor
Name:
BDBM191056
Synonyms:
US9181253, 118
Type:
Small organic molecule
Emp. Form.:
C16H22ClN5O2
Mol. Mass.:
351.831
SMILES:
CCC(CC)Nc1nc(Cl)nc2n(cnc12)[C@]12C[C@H]1[C@@H](O)[C@@H](O)C2
: