Target
Lysine-specific demethylase 5A [1-1090]
Ligand
BDBM191596
Substrate
Meas. Tech.
AlphaLISA Assay
pH
7.2±n/a
Temperature
298.15±n/a K
IC50
4.9e+2± 4e+1 nM
Comments
extracted
Citation
 Horton, JRLiu, XGale, MWu, LShanks, JRZhang, XWebber, PJBell, JSKales, SCMott, BTRai, GJansen, DJHenderson, MJUrban, DJHall, MDSimeonov, AMaloney, DJJohns, MAFu, HJadhav, AVertino, PMYan, QCheng, X Structural Basis for KDM5A Histone Lysine Demethylase Inhibition by Diverse Compounds. Cell Chem Biol 23:769-81 (2016)  
Target
Name:
Lysine-specific demethylase 5A [1-1090]
Synonyms:
JARID1A KDM5A_HUMAN Lysine-specific demethylase 5A (KDM5Flag-KDM5A-FL) RBP2
Type:
Protein
Mol. Mass.:
124246.30
Organism:
Homo sapiens (Human)
Description:
Truncation 1-1090aa
Residue:
1090
  
Inhibitor
Name:
BDBM191596
Synonyms:
6-isopropyl-5-methyl-7-oxo-4,7-dihydropyrazolo[1,5-a]pyrimidine-3-carbonitrile (N8)
Type:
Small organic molecule
Emp. Form.:
C11H12N4O
Mol. Mass.:
216.2392
SMILES:
CC(C)c1c(C)[nH]c2c(cnn2c1=O)C#N
: