Target
Lysine-specific demethylase 5B
Ligand
BDBM50396019
Substrate
Meas. Tech.
AlphaLISA Assay
pH
7.2±n/a
Temperature
298.15±n/a K
IC50
1.2e+2± 1e+1 nM
Comments
extracted
Citation
 Horton, JRLiu, XGale, MWu, LShanks, JRZhang, XWebber, PJBell, JSKales, SCMott, BTRai, GJansen, DJHenderson, MJUrban, DJHall, MDSimeonov, AMaloney, DJJohns, MAFu, HJadhav, AVertino, PMYan, QCheng, X Structural Basis for KDM5A Histone Lysine Demethylase Inhibition by Diverse Compounds. Cell Chem Biol 23:769-81 (2016)  
Target
Name:
Lysine-specific demethylase 5B
Synonyms:
CT31 Histone demethylase JARID1B Jumonji/ARID domain-containing protein 1B KDM5B_HUMAN Lysine-specific demethylase 5B (KDM5Flag-5B-FL) PLU1 RBP2-H1 | Retinoblastoma-binding protein 2 homolog 1
Type:
Protein
Mol. Mass.:
175659.67
Organism:
Homo sapiens (Human)
Description:
Q9UGL1
Residue:
1544
  
Inhibitor
Name:
BDBM50396019
Synonyms:
4'-(phenethylcarbamoyl)-[2,2'-bipyridine]-4-carboxylic acid (N3) | CHEMBL2169917
Type:
Small organic molecule
Emp. Form.:
C20H17N3O3
Mol. Mass.:
347.3673
SMILES:
OC(=O)c1ccnc(c1)-c1cc(ccn1)C(=O)NCCc1ccccc1
: