Target
Lysine-specific demethylase 4C
Ligand
BDBM26106
Substrate
Meas. Tech.
Demethylase AlphaScreen Assay
pH
7.5±n/a
IC50
4.15e+4±n/a nM
Comments
extracted
Citation
 Johansson, CVelupillai, STumber, ASzykowska, AHookway, ESNowak, RPStrain-Damerell, CGileadi, CPhilpott, MBurgess-Brown, NWu, NKopec, JNuzzi, ASteuber, HEgner, UBadock, VMunro, SLaThangue, NBWestaway, SBrown, JAthanasou, NPrinjha, RBrennan, PEOppermann, U Structural analysis of human KDM5B guides histone demethylase inhibitor development. Nat Chem Biol 12:539-45 (2016)  
Target
Name:
Lysine-specific demethylase 4C
Synonyms:
GASC-1 protein Gene amplified in squamous cell carcinoma 1 protein JMJD2C Jumonji domain-containing protein 2C KDM4C_HUMAN | KIAA0780
Type:
Protein
Mol. Mass.:
119979.01
Organism:
Homo sapiens (Human)
Description:
Q9H3R0
Residue:
1056
  
Inhibitor
Name:
BDBM26106
Synonyms:
CHEMBL90852 NOG [(carboxymethyl)carbamoyl]formic acid
Type:
Small organic molecule
Emp. Form.:
C4H5NO5
Mol. Mass.:
147.0862
SMILES:
OC(=O)CNC(=O)C(O)=O
: