Target
Acetyl-CoA carboxylase 1 [39-967]
Ligand
BDBM196505
Substrate
Meas. Tech.
ACC1 Enzyme Assay B1
pH
7.5±n/a
Temperature
295.15±n/a K
IC50
428±n/a nM
Comments
extracted
Citation
 Liu, NThede, KLienau, PScholz, AHilger, CBömer, UNajjar, MEis, KFischer, RMoradi, WA (5s,8s)-3-(4′-chlor-3′-fluor-4-methlybiphenyl-3-yl)-4-hydroxy-8-methoxy-1-azaspiro[4.5] dec-3-en-2-one (compound A) for treatment US Patent  US9212140 Publication Date 12/15/2015 
Target
Name:
Acetyl-CoA carboxylase 1 [39-967]
Synonyms:
ACAC ACACA_HUMAN ACCA | Acetyl-CoA carboxylase 1 (ACC1)
Type:
Enzyme
Mol. Mass.:
103145.80
Organism:
Homo sapiens (Human)
Description:
C-terminally FLAG-tagged recombinant human ACC1 (GenBank Accession no. NM-198834, amino acids 39 - end), expressed in baculovirus-transfected insect cells (Hi5)
Residue:
929
  
Inhibitor
Name:
BDBM196505
Synonyms:
US9212140, C.2
Type:
Small organic molecule
Emp. Form.:
C23H23Cl2NO2
Mol. Mass.:
416.34
SMILES:
COC1CCC2(CC1)NC(=O)C(=C2)c1cc(ccc1C)-c1ccc(Cl)c(Cl)c1
: