Target
L-lactate dehydrogenase B chain
Ligand
BDBM197160
Substrate
Meas. Tech.
LHDA/LDHB Enzymatic Assays
IC50
5±n/a nM
Citation
 Boudreau, APurkey, HEHitz, ARobarge, KPeterson, DLabadie, SKwong, MHong, RGao, MDel Nagro, CPusapati, RMa, SSalphati, LPang, JZhou, ALai, TLi, YChen, ZWei, BYen, ISideris, SMcCleland, MFirestein, RCorson, LVanderbilt, AWilliams, SDaemen, ABelvin, MEigenbrot, CJackson, PKMalek, SHatzivassiliou, GSampath, DEvangelista, MO'Brien, T Metabolic plasticity underpins innate and acquired resistance to LDHA inhibition. Nat Chem Biol 12:779-86 (2016)  
Target
Name:
L-lactate dehydrogenase B chain
Synonyms:
L-lactate dehydrogenase B LDH heart subunit LDH-H LDHB_HUMAN Renal carcinoma antigen NY-REN-46
Type:
Oxidoreductase; homotetramer
Mol. Mass.:
36635.55
Organism:
Homo sapiens (Human)
Description:
Residue:
334
  
Inhibitor
Name:
BDBM197160
Synonyms:
GNE-140 (6)
Type:
Small organic molecule
Emp. Form.:
C25H23ClN2O3S2
Mol. Mass.:
499.045
SMILES:
OC1=C(Sc2ccccc2Cl)C(=O)N[C@@](C1)(c1ccsc1)c1ccc(cc1)N1CCOCC1
: