Host
BDBM197309
Ligand
BDBM197312
Substrate
Meas. Tech.
NMR (OAH or OAMe)
pH
11.5±n/a
Temperature
278±n/a K
ΔG°
-9.96±0.08 kJ/mole
Kd
17900000±899000 nM
Citation
 Yin, JHenriksen, NMSlochower, DRShirts, MRChiu, MWMobley, DLGilson, MK Overview of the SAMPL5 host-guest challenge: Are we doing better? J Comput Aided Mol Des 31:1-19 (2016)  
Host
Name:
BDBM197309
Synonyms:
SAMPL5, OAMe | SAMPL5, TEMOA
Type:
Molecular Host
Emp. Form.:
C100H72O32
Mol. Mass.:
1785.6225
SMILES:
Cc1c2O[C@H]3Oc4c(C)c5O[C@H]6Oc7c(C)c8O[C@H]9Oc%10c(C)c%11O[C@@H](Oc1c1cc2[C@H](CCC(O)=O)c4cc5[C@H](CCC(O)=O)c7cc8[C@H](CCC(O)=O)c%10cc%11[C@@H]1CCC(O)=O)c1cc2Oc4cc(Oc5cc(Oc7cc(Oc8cc(Oc%10cc(Oc%11cc(Oc%12cc(Oc(c2)c1)cc(c%12)C(O)=O)cc3c%11)cc(c%10)C(O)=O)cc6c8)cc(c7)C(O)=O)cc9c5)cc(c4)C(O)=O
:
Inhibitor
Name:
BDBM197312
Synonyms:
SAMPL5, OA-G4
Type:
Small organic molecule
Emp. Form.:
C11H14BrO2
Mol. Mass.:
258.132
SMILES:
: