Host
BDBM197310
Ligand
BDBM197315
Substrate
Meas. Tech.
NMR (OBClip)
pH
7.4±n/a
Temperature
298±n/a K
ΔG°
-10.5±0.29 kJ/mole
Kd
14300000±1630000 nM
Citation
 Yin, JHenriksen, NMSlochower, DRShirts, MRChiu, MWMobley, DLGilson, MK Overview of the SAMPL5 host-guest challenge: Are we doing better? J Comput Aided Mol Des 31:1-19 (2016)  
Host
Name:
BDBM197310
Synonyms:
SAMPL5, CBClip
Type:
Molecular Host
Emp. Form.:
C50H56N8O20S4
Mol. Mass.:
1217.283
SMILES:
C[C@@]12N3Cc4cc5c(OCCCS([O-])(=O)=O)ccc(OCCCS([O-])(=O)=O)c5cc4CN1C(=O)N1CN4C(=O)N5Cc6cc7c(OCCCS([O-])(=O)=O)ccc(OCCCS([O-])(=O)=O)c7cc6CN6C(=O)N(CN(C3=O)[C@]21C)[C@@]4(C)[C@]56C
:
Inhibitor
Name:
BDBM197315
Synonyms:
SAMPL5, CBC-G2
Type:
Small organic molecule
Emp. Form.:
C4H14N2
Mol. Mass.:
90.1663
SMILES:
[NH3+]CCCC[NH3+]
: