Host
BDBM197310
Ligand
BDBM197316
Substrate
Meas. Tech.
NMR (OBClip)
pH
7.4±n/a
Temperature
298±n/a K
ΔG°
-16.82±0.13 kJ/mole
Kd
1140000±64600 nM
Citation
 Yin, JHenriksen, NMSlochower, DRShirts, MRChiu, MWMobley, DLGilson, MK Overview of the SAMPL5 host-guest challenge: Are we doing better? J Comput Aided Mol Des 31:1-19 (2016)  
Host
Name:
BDBM197310
Synonyms:
SAMPL5, CBClip
Type:
Molecular Host
Emp. Form.:
C50H56N8O20S4
Mol. Mass.:
1217.283
SMILES:
C[C@@]12N3Cc4cc5c(OCCCS([O-])(=O)=O)ccc(OCCCS([O-])(=O)=O)c5cc4CN1C(=O)N1CN4C(=O)N5Cc6cc7c(OCCCS([O-])(=O)=O)ccc(OCCCS([O-])(=O)=O)c7cc6CN6C(=O)N(CN(C3=O)[C@]21C)[C@@]4(C)[C@]56C
:
Inhibitor
Name:
BDBM197316
Synonyms:
SAMPL5, CBC-G3
Type:
Small organic molecule
Emp. Form.:
C10H30N4
Mol. Mass.:
206.3698
SMILES:
[NH3+]CCC[NH2+]CCCC[NH2+]CCC[NH3+]
: