Target
Tyrosine-protein kinase receptor
Ligand
BDBM50306682
Substrate
Meas. Tech.
Inhibition Assay
IC50
2.9±n/a nM
Citation
 Wang, ZLi, LWang, Z Spirocyclic molecules as protein kinase inhibitors US Patent  US9226923 Publication Date 1/5/2016 
Target
Name:
Tyrosine-protein kinase receptor
Synonyms:
ALK tyrosine kinase receptor (ALK) (R1275Q) | ALK tyrosine kinase receptor (R1275Q)
Type:
Enzyme Catalytic Domain
Mol. Mass.:
176424.03
Organism:
Homo sapiens (Human)
Description:
Residue:
1620
  
Inhibitor
Name:
BDBM50306682
Synonyms:
(R)-3-(1-(2,6-dichloro-3-fluorophenyl)ethoxy)-5-(1-(piperidin-4-yl)-1H-pyrazol-4-yl)pyridin-2-amine 3-[(1R)-1-(2,6-dichloro-3-fluorophenyl)ethoxy]-5-(1-piperidin-4-yl-1H-pyrazol-4-yl)pyridin-2-amine CRIZOTINIB US10370379, Crizotinib US10780082, Compound Crizotinib US11517561, Compound Crizotinib US9199944, Crizotinib | US9226923, Crizotinib
Type:
Small organic molecule
Emp. Form.:
C21H22Cl2FN5O
Mol. Mass.:
450.337
SMILES:
C[C@@H](Oc1cc(cnc1N)-c1cnn(c1)C1CCNCC1)c1c(Cl)ccc(F)c1Cl
: