Target
Adenosine receptor A1
Ligand
BDBM50424715
Substrate
Meas. Tech.
Radioligand Binding Assay
Ki
2010±830 nM
Citation
 Rodríguez, DChakraborty, SWarnick, ECrane, SGao, ZGO'Connor, RJacobson, KACarlsson, J Structure-Based Screening of Uncharted Chemical Space for Atypical Adenosine Receptor Agonists ACS Chem Biol 11:2763-2772 (2016)  
Target
Name:
Adenosine receptor A1
Synonyms:
A1 adenosine receptor (hA1) AA1R_HUMAN ADORA1 Adenosine A1-receptor Adenosine receptor A1 (hA1) | Adenosine transporter (AdT)
Type:
G Protein-Coupled Receptor (GPCR)
Mol. Mass.:
36520.92
Organism:
Homo sapiens (Human)
Description:
P30542
Residue:
326
  
Inhibitor
Name:
BDBM50424715
Synonyms:
AZACITIDINE Ladakamycin Vidaza
Type:
Small organic molecule
Emp. Form.:
C8H12N4O5
Mol. Mass.:
244.2047
SMILES:
Nc1ncn([C@@H]2O[C@H](CO)[C@@H](O)[C@H]2O)c(=O)n1
: