Target
Aldo-keto reductase family 1 member B10
Ligand
BDBM104020
Substrate
Meas. Tech.
IC50-Activity Assay (AR)
pH
7±n/a
IC50
4.5e+3± 7e+2 nM
Comments
extracted
Citation
 Cousido-Siah, ARuiz, FXFranflík, JGiménez-Dejoz, JMitschler, AKamlar, MVesely´, JAjani, HParés, XFarrés, JHobza, PPodjarny, AD IDD388 Polyhalogenated Derivatives as Probes for an Improved Structure-Based Selectivity of AKR1B10 Inhibitors ACS Chem Biol 11:2693-2705 (2016)  
Target
Name:
Aldo-keto reductase family 1 member B10
Synonyms:
AK1BA_HUMAN AKR1B11 ARP Aldo-keto reductase family 1 member B10 (AKR1B10) Aldose reductase-like SI reductase hARP
Type:
Protein
Mol. Mass.:
36024.67
Organism:
Homo sapiens (Human)
Description:
O60218. 1ZUA; 4JII; 4GQ0
Residue:
316
  
Inhibitor
Name:
BDBM104020
Synonyms:
MK181
Type:
Small organic molecule
Emp. Form.:
C16H13BrClNO4
Mol. Mass.:
398.636
SMILES:
OC(=O)COc1cc(Cl)ccc1C(=O)NCc1ccc(Br)cc1
: