Target
Aldo-keto reductase family 1 member B1
Ligand
BDBM16313
Substrate
Meas. Tech.
IC50-Activity Assay (AR)
pH
7±n/a
IC50
3.0±n/a nM
Comments
extracted
Citation
 Cousido-Siah, ARuiz, FXFranflík, JGiménez-Dejoz, JMitschler, AKamlar, MVesely´, JAjani, HParés, XFarrés, JHobza, PPodjarny, AD IDD388 Polyhalogenated Derivatives as Probes for an Improved Structure-Based Selectivity of AKR1B10 Inhibitors ACS Chem Biol 11:2693-2705 (2016)  
Target
Name:
Aldo-keto reductase family 1 member B1
Synonyms:
AKR1B1 ALDR_HUMAN AR Aldose Reductase (ALR2) Aldose reductase (AR)
Type:
Protein
Mol. Mass.:
35855.50
Organism:
Homo sapiens (Human)
Description:
P15121. 4LAU; 2IKI; 4LB4; 2FZD; 2FZ8; 1US0
Residue:
316
  
Inhibitor
Name:
BDBM16313
Synonyms:
2-(2-{[(4-bromo-2-fluorophenyl)methyl]carbamothioyl}-5-fluorophenoxy)acetic acid IDD 594 LdT | {2-[(4-bromo-2-fluorobenzyl)carbamothioyl]-5-fluorophenoxy}acetic acid
Type:
Small organic molecule
Emp. Form.:
C16H12BrF2NO3S
Mol. Mass.:
416.237
SMILES:
OC(=O)COc1cc(F)ccc1C(=S)NCc1ccc(Br)cc1F
: