Target
ELAV-like protein 1 [I180A]
Ligand
BDBM82867
Substrate
IC50
44400±n/a nM
Citation
 PubChem, PC Identify HuR specific inhibitors PubChem Bioassay (2015)[AID] 
Target
Name:
ELAV-like protein 1 [I180A]
Synonyms:
ELAV1_HUMAN HUR | HuR RNA binding protein
Type:
Enzyme Catalytic Domain
Mol. Mass.:
36072.53
Organism:
Homo sapiens (Human)
Description:
gi_1022961
Residue:
326
  
Inhibitor
Name:
BDBM82867
Synonyms:
6-penta-1,3-diynyl-2-pyranone MLS000737691 cid_265580
Type:
Small organic molecule
Emp. Form.:
C10H6O2
Mol. Mass.:
158.1534
SMILES:
CC#CC#Cc1cccc(=O)o1
: