Target
Cystic fibrosis transmembrane conductance regulator
Ligand
BDBM50018518
Substrate
EC50
>50000±n/a nM
Citation
 PubChem, PC Phenotypic Assay to Identify Small Molecules that Upregulate Production of hCFTR in HeLa Cells PubChem Bioassay (2016)[AID] 
Target
Name:
Cystic fibrosis transmembrane conductance regulator
Synonyms:
ABCC7 CFTR Channel conductance-controlling ATPase | cAMP-dependent chloride channel
Type:
Enzyme Catalytic Domain
Mol. Mass.:
168171.30
Organism:
Homo sapiens (Human)
Description:
gi_90421313
Residue:
1480
  
Inhibitor
Name:
BDBM50018518
Synonyms:
((E)-6,6-Dimethyl-hept-2-en-4-ynyl)-methyl-naphthalen-1-ylmethyl-amine (6,6-Dimethyl-hept-2-en-4-ynyl)-methyl-naphthalen-1-ylmethyl-amine(Terbinafine) 1N,6,6-trimethyl-1N-(1-naphthylmethyl)-(E)-2-hepten-4-yn-1-amine Lamisil N,6,6-trimethyl-N-(naphthalen-1-ylmethyl)hept-2-en-4-yn-1-amine SF-86-327 Terbinafin cid_1549008
Type:
Small organic molecule
Emp. Form.:
C21H25N
Mol. Mass.:
291.4299
SMILES:
CN(C\C=C\C#CC(C)(C)C)Cc1cccc2ccccc12
: