Target
Cystic fibrosis transmembrane conductance regulator
Ligand
BDBM50017896
Substrate
EC50
>50000±n/a nM
Citation
 PubChem, PC Phenotypic Assay to Identify Small Molecules that Upregulate Production of hCFTR in HeLa Cells PubChem Bioassay (2016)[AID] 
Target
Name:
Cystic fibrosis transmembrane conductance regulator
Synonyms:
ABCC7 CFTR Channel conductance-controlling ATPase | cAMP-dependent chloride channel
Type:
Enzyme Catalytic Domain
Mol. Mass.:
168171.30
Organism:
Homo sapiens (Human)
Description:
gi_90421313
Residue:
1480
  
Inhibitor
Name:
BDBM50017896
Synonyms:
(E)-3-(4-Imidazol-1-ylmethyl-phenyl)-acrylic acid CHEMBL11662 Ozagrel | cid_5282440
Type:
Small organic molecule
Emp. Form.:
C13H12N2O2
Mol. Mass.:
228.2466
SMILES:
OC(=O)\C=C\c1ccc(Cn2ccnc2)cc1
: