Target
Cystic fibrosis transmembrane conductance regulator
Ligand
BDBM200249
Substrate
EC50
>62000±n/a nM
Citation
 PubChem, PC Phenotypic Assay to Identify Small Molecules that Upregulate Production of hCFTR in HeLa Cells PubChem Bioassay (2016)[AID] 
Target
Name:
Cystic fibrosis transmembrane conductance regulator
Synonyms:
ABCC7 CFTR Channel conductance-controlling ATPase | cAMP-dependent chloride channel
Type:
Enzyme Catalytic Domain
Mol. Mass.:
168171.30
Organism:
Homo sapiens (Human)
Description:
gi_90421313
Residue:
1480
  
Inhibitor
Name:
BDBM200249
Synonyms:
AB01000507-01 | cid_41402338
Type:
Small organic molecule
Emp. Form.:
C20H16O4
Mol. Mass.:
320.3386
SMILES:
Cc1ccc2c(COc3cccc4C(=O)CCc34)cc(=O)oc2c1
: